{"text_format":"1","workbook":"xlsx","n_sheets":3,"sheets":["NCTool","Required Values","Version History"],"not_rendered":{"charts":0,"images":2,"macros":1,"external_links":0,"defined_names":7,"comments":0,"pivot_tables":0},"unopened":[],"bounds":{"document_bytes":16777216,"sheet_cells":100000,"rows_first":2000,"rows_last":500,"rows_between":2000,"halvings":0,"cell_chars":16384,"cell_head_chars":4096},"cells_cut":0,"cells_raw":0,"read":"whole","date_system":"1900"}

{"sheet":"NCTool","index":0,"n_rows":19,"n_cols":54,"rows_kept":19,"cut":false,"hidden":false,"merged":[[18,3,18,4],[9,2,9,4],[9,6,9,9],[0,0,0,20],[11,2,11,4],[5,2,5,4],[7,2,7,4],[3,13,3,18],[7,6,7,9],[5,6,5,9],[11,6,11,9]]}
["MGLVA CC Session 'Required Naming Convention' Tool"]
[null,null,null,null,null,null,null,null,null,null,null,null,null,null,null,null,null,null,null,null,null,null,null,null,null,null,null,null,null,null,null,null,null,null,null,null,null,null,null,null,null,null,null,null,null,null,null,null,null,null,null,null,{"$f":"IFERROR(VLOOKUP(G6,'Required Values'!E:G,3,FALSE)&\"_\"&G8&\"_\"&G10&\"_\"&VLOOKUP(G12,'Required Values'!A:B,2,FALSE),\"\")","v":""},{"$f":"LEN(BA2)","v":0}]
[null,null,null,null,null,null,null,null,null,null,null,null,null,null,null,null,null,null,null,null,null,null,null,null,null,null,null,null,null,null,null,null,null,null,null,null,null,null,null,null,null,null,null,null,null,null,null,null,null,null,null,null,"Values","Char Used"]
[null,null,null,"*Required Fields",null,null,null,null,null,null,null,null,null,{"$f":"CONCATENATE(\"Character's Remaining: \",(64 -BB2), \"/64\")","v":"Character's Remaining: 64/64"},null,null,null,null,null,null,null,null,null,null,null,null,null,null,null,null,null,null,null,null,null,null,null,null,null,null,null,null,null,null,null,null,null,null,null,null,null,null,{"$f":"VLOOKUP(G12,'Required Values'!A:B,2,FALSE)","v":{"$error":"#N/A"}},{"$f":"LEN(BA4)","v":{"$error":"#N/A"}}]
[]
[null,null,"Course Code*",null,null,null,null,null,null,null,null,null,null,null,null,null,null,null,null,null,null,null,null,null,null,null,null,null,null,null,null,null,null,null,null,null,null,null,null,null,null,null,null,null,null,null,null,null,null,null,null,null,{"$f":"VLOOKUP(G6,'Required Values'!E:G,3,FALSE)","v":{"$error":"#N/A"}},{"$f":"LEN(BA6)","v":{"$error":"#N/A"}}]
[null,null,null,null,null,null,null,null,null,null,null,null,null,null,null,null,null,null,null,null,null,null,null,null,null,null,null,null,null,null,null,null,null,null,null,null,null,null,null,null,null,null,null,null,null,null,null,null,null,null,null,null,{"$f":"G8","v":0},1]
[null,null,"Unit Number*",null,null,null,null,null,null,null,null,null,null,null,null,null,null,null,null,null,null,null,null,null,null,null,null,null,null,null,null,null,null,null,null,null,null,null,null,null,null,null,null,null,null,null,null,null,null,null,null,null,{"$f":"G10","v":0},1]
[]
[null,null,"Lesson Number*",null,null,null,null,null,null,null,null,null,null,null,null,null,null,null,null,null,null,null,null,null,null,null,null,null,null,null,null,null,null,null,null,null,null,null,null,null,null,null,null,null,null,null,null,null,null,null,null,null,"Total Req'd:",{"$f":"SUM(BB4:BB9)","v":{"$error":"#N/A"}}]
[]
[null,null,"Session Requirement*"]
[]
[null,null,null,null,null,null,null,null,null,null,null,null,null,null,null,null,null,null,null,null,null,null,null,null,null,null,null,null,null,null,null,null,null,null,null,null,null,null,null,null,null,null,null,null,null,null,null,null,null,null,null,null,"IFERROR(CONCATENATE(VLOOKUP(G5,'Required Values'!A:B,2,FALSE),\"_\",VLOOKUP(G7,'Required Values'!E:G,3,FALSE),\"_\",G9,\"_\",G11,IF(G17 = \"\", ,\" \"),LEFT(G17,(58-BB10)),,\"_\",VLOOKUP(G13,'Required Values'!H:I,2,FALSE),\":\",VLOOKUP(G15,'Required Values'!C:D,2,FALSE)),\"\")"]
[]
[null,null,null,null,null,null,null,null,null,null,null,null,null,null,null,null,null,null,null,null,null,null,null,null,null,null,null,null,null,null,null,null,null,null,null,null,null,null,null,null,null,null,null,null,null,null,null,null,null,null,null,null,"VLOOKUP(G7,'Required Values'!E:G,3,FALSE)"]
[null,null,null,null,null,null,null,null,null,null,null,null,null,null,null,null,null,null,null,null,null,null,null,null,null,null,null,null,null,null,null,null,null,null,null,null,null,null,null,null,null,null,null,null,null,null,null,null,null,null,null,null,"G9"]
[null,null,null,null,null,null,null,null,null,null,null,null,null,null,null,null,null,null,null,null,null,null,null,null,null,null,null,null,null,null,null,null,null,null,null,null,null,null,null,null,null,null,null,null,null,null,null,null,null,null,null,null,"G11"]
["Version: 1.2",null,"Date:","2015-08-24",null,null,null,null,null,null,null,null,null,null,null,null,null,null,null,null,null,null,null,null,null,null,null,null,null,null,null,null,null,null,null,null,null,null,null,null,null,null,null,null,null,null,null,null,null,null,null,null,"VLOOKUP(G5,'Required Values'!A:B,2,FALSE)"]

{"sheet":"Required Values","index":1,"n_rows":710,"n_cols":9,"rows_kept":710,"cut":false,"hidden":false,"merged":[]}
["Full_SessionRequirement","Code_SessionRequirement","Full_Subject","Code_Subject","Con_CourseName&Code","Full_CourseName","Code_CourseCode","Full_TypeofSession","Code_TypeofSession"]
["Required","REQ","Advisory/Homeroom","ADV",{"$f":"CONCATENATE(G2,\":\",F2,\"\")","v":"ATASLA:American Sign Language (Attendance)"},"American Sign Language (Attendance)","ATASLA","Class Connect","CC"]
["Optional ","OPT","Art","ART",{"$f":"CONCATENATE(G3,\":\",F3,\"\")","v":"ATELL:ELL English as a Learned Language"},"ELL English as a Learned Language","ATELL","Learning Coach Sessions","LC"]
["Special Ed service time","SE","Business","BUS",{"$f":"CONCATENATE(G4,\":\",F4,\"\")","v":"ATNMAL:National Math Lab (Attendance)"},"National Math Lab (Attendance)","ATNMAL","Other & Testing","OT"]
[null,null,"Chinese","CHI",{"$f":"CONCATENATE(G5,\":\",F5,\"\")","v":"ATNMPT:PT National Math Lab (Attendance)"},"PT National Math Lab (Attendance)","ATNMPT","Small Group","SG"]
[null,null,"Elective","ELE",{"$f":"CONCATENATE(G6,\":\",F6,\"\")","v":"ATT-030V1-K:Essential Math A (Attendance)"},"Essential Math A (Attendance)","ATT-030V1-K","Study Island","SI"]
[null,null,"English","ENG",{"$f":"CONCATENATE(G7,\":\",F7,\"\")","v":"ATT-075V1-K:Life Skills (HS Attendance)"},"Life Skills (HS Attendance)","ATT-075V1-K","Family Support Team","FAST"]
[null,null,"Finding Your Path","FYP",{"$f":"CONCATENATE(G8,\":\",F8,\"\")","v":"ATT-159V1-K:A+ Algebra 1B (Attendance)"},"A+ Algebra 1B (Attendance)","ATT-159V1-K","Counseling","COU"]
[null,null,"French","FRE",{"$f":"CONCATENATE(G9,\":\",F9,\"\")","v":"ATT-160V1-K:A+ Math - A Plus (Attendance)"},"A+ Math - A Plus (Attendance)","ATT-160V1-K"]
[null,null,"German","GER",{"$f":"CONCATENATE(G10,\":\",F10,\"\")","v":"ATT-161V1-K:A+ Geometry (Attendance)"},"A+ Geometry (Attendance)","ATT-161V1-K"]
[null,null,"History","HST",{"$f":"CONCATENATE(G11,\":\",F11,\"\")","v":"ATT-162V1-K:A+ English I (Attendance)"},"A+ English I (Attendance)","ATT-162V1-K"]
[null,null,"Japanese","JAP",{"$f":"CONCATENATE(G12,\":\",F12,\"\")","v":"ATT-163V1-K:A+ English II (Attendance)"},"A+ English II (Attendance)","ATT-163V1-K"]
[null,null,"Latin","LAT",{"$f":"CONCATENATE(G13,\":\",F13,\"\")","v":"ATT-164V1-K:A+ Biology (Attendance)"},"A+ Biology (Attendance)","ATT-164V1-K"]
[null,null,"Math","MTH",{"$f":"CONCATENATE(G14,\":\",F14,\"\")","v":"ATT-165V1-K:A+ Physical Science (Attendance)"},"A+ Physical Science (Attendance)","ATT-165V1-K"]
[null,null,"Music","MUS",{"$f":"CONCATENATE(G15,\":\",F15,\"\")","v":"ATT-166V1-K:A+ Earth Science (Attendance)"},"A+ Earth Science (Attendance)","ATT-166V1-K"]
[null,null,"Science","SCI",{"$f":"CONCATENATE(G16,\":\",F16,\"\")","v":"ATT-167V1-K:A+ U.S. History I (Attendance)"},"A+ U.S. History I (Attendance)","ATT-167V1-K"]
[null,null,"Spanish","SPA",{"$f":"CONCATENATE(G17,\":\",F17,\"\")","v":"ATT-168V1-K:A+ U.S. History II (Attendance)"},"A+ U.S. History II (Attendance)","ATT-168V1-K"]
[null,null,"Technology","TCH",{"$f":"CONCATENATE(G18,\":\",F18,\"\")","v":"ATT-169V1-K:A+ U.S. Government (Attendance)"},"A+ U.S. Government (Attendance)","ATT-169V1-K"]
[null,null,"Writing","WRI",{"$f":"CONCATENATE(G19,\":\",F19,\"\")","v":"ATT-170V1-K:A+ Economics (Attendance)"},"A+ Economics (Attendance)","ATT-170V1-K"]
[null,null,null,null,{"$f":"CONCATENATE(G20,\":\",F20,\"\")","v":"ATT-171V1-K:A+ U.S. Geography (Attendance)"},"A+ U.S. Geography (Attendance)","ATT-171V1-K"]
[null,null,null,null,{"$f":"CONCATENATE(G21,\":\",F21,\"\")","v":"ATT-172V1-K:A+ World Geography (Attendance)"},"A+ World Geography (Attendance)","ATT-172V1-K"]
[null,null,null,null,{"$f":"CONCATENATE(G22,\":\",F22,\"\")","v":"ATT-173V1-K:A+ Health (Attendance)"},"A+ Health (Attendance)","ATT-173V1-K"]
[null,null,null,null,{"$f":"CONCATENATE(G23,\":\",F23,\"\")","v":"ATT-174V1-K:A+ Personal Finance (Attendance)"},"A+ Personal Finance (Attendance)","ATT-174V1-K"]
[null,null,null,null,{"$f":"CONCATENATE(G24,\":\",F24,\"\")","v":"ATT-175V1-K:A+ Career Essentials (Attendance)"},"A+ Career Essentials (Attendance)","ATT-175V1-K"]
[null,null,null,null,{"$f":"CONCATENATE(G25,\":\",F25,\"\")","v":"ATT-176V1-K:A+ Art Appreciation (Attendance)"},"A+ Art Appreciation (Attendance)","ATT-176V1-K"]
[null,null,null,null,{"$f":"CONCATENATE(G26,\":\",F26,\"\")","v":"ATT-177V1-K:A+ Humanities I - Performing Arts (Attendance)"},"A+ Humanities I - Performing Arts (Attendance)","ATT-177V1-K"]
[null,null,null,null,{"$f":"CONCATENATE(G27,\":\",F27,\"\")","v":"ATT-178V1-K:A+ Humanities II - Literary Arts (Attendance)"},"A+ Humanities II - Literary Arts (Attendance)","ATT-178V1-K"]
[null,null,null,null,{"$f":"CONCATENATE(G28,\":\",F28,\"\")","v":"ATT-179V1-K:A+ Algebra 1A (Attendance)"},"A+ Algebra 1A (Attendance)","ATT-179V1-K"]
[null,null,null,null,{"$f":"CONCATENATE(G29,\":\",F29,\"\")","v":"ATT-185V1-K:ACT/SAT Prep (Attendance)"},"ACT/SAT Prep (Attendance)","ATT-185V1-K"]
[null,null,null,null,{"$f":"CONCATENATE(G30,\":\",F30,\"\")","v":"ATT-187V1-K:National Clubs (Attendance)"},"National Clubs (Attendance)","ATT-187V1-K"]
[null,null,null,null,{"$f":"CONCATENATE(G31,\":\",F31,\"\")","v":"ATT-197V1-K:SE Reading (Attendance)"},"SE Reading (Attendance)","ATT-197V1-K"]
[null,null,null,null,{"$f":"CONCATENATE(G32,\":\",F32,\"\")","v":"ATT-198V1-K:SE Math (Attendance)"},"SE Math (Attendance)","ATT-198V1-K"]
[null,null,null,null,{"$f":"CONCATENATE(G33,\":\",F33,\"\")","v":"ATT-199V1-K:SE Writing (Attendance)"},"SE Writing (Attendance)","ATT-199V1-K"]
[null,null,null,null,{"$f":"CONCATENATE(G34,\":\",F34,\"\")","v":"ATT-200V1-K:SE Transition (Attendance)"},"SE Transition (Attendance)","ATT-200V1-K"]
[null,null,null,null,{"$f":"CONCATENATE(G35,\":\",F35,\"\")","v":"ATT-201V1-K:SE Study Skills (Attendance)"},"SE Study Skills (Attendance)","ATT-201V1-K"]
[null,null,null,null,{"$f":"CONCATENATE(G36,\":\",F36,\"\")","v":"ATT-202V1-K:Unique Learning System (Attendance)"},"Unique Learning System (Attendance)","ATT-202V1-K"]
[null,null,null,null,{"$f":"CONCATENATE(G37,\":\",F37,\"\")","v":"ATT-332V1-K:National Math Lab FT Summer (Attendance)"},"National Math Lab FT Summer (Attendance)","ATT-332V1-K"]
[null,null,null,null,{"$f":"CONCATENATE(G38,\":\",F38,\"\")","v":"ATT-333V1-K:National Math Lab PT Summer (Attendance)"},"National Math Lab PT Summer (Attendance)","ATT-333V1-K"]
[null,null,null,null,{"$f":"CONCATENATE(G39,\":\",F39,\"\")","v":"ATT-346V1-K:Dual Enrollment Elective (Attendance)"},"Dual Enrollment Elective (Attendance)","ATT-346V1-K"]
[null,null,null,null,{"$f":"CONCATENATE(G40,\":\",F40,\"\")","v":"ATT-359V1-K:A+ Social Studies (Attendance)"},"A+ Social Studies (Attendance)","ATT-359V1-K"]
[null,null,null,null,{"$f":"CONCATENATE(G41,\":\",F41,\"\")","v":"ATT-360V1-K:A+ Science (Attendance)"},"A+ Science (Attendance)","ATT-360V1-K"]
[null,null,null,null,{"$f":"CONCATENATE(G42,\":\",F42,\"\")","v":"ATT-361V1-K:A+ English (Attendance)"},"A+ English (Attendance)","ATT-361V1-K"]
[null,null,null,null,{"$f":"CONCATENATE(G43,\":\",F43,\"\")","v":"ATT-362V1-K:A+ Elective (Attendance)"},"A+ Elective (Attendance)","ATT-362V1-K"]
[null,null,null,null,{"$f":"CONCATENATE(G44,\":\",F44,\"\")","v":"ATT-375V1-K:A+ English III A (Attendance)"},"A+ English III A (Attendance)","ATT-375V1-K"]
[null,null,null,null,{"$f":"CONCATENATE(G45,\":\",F45,\"\")","v":"ATT-376V1-K:A+ English IV A (Attendance)"},"A+ English IV A (Attendance)","ATT-376V1-K"]
[null,null,null,null,{"$f":"CONCATENATE(G46,\":\",F46,\"\")","v":"ATT-377V1-K:A+ Consumer Math (Attendance)"},"A+ Consumer Math (Attendance)","ATT-377V1-K"]
[null,null,null,null,{"$f":"CONCATENATE(G47,\":\",F47,\"\")","v":"ATT-378V1-K:A+ Pre-Algebra A (Attendance)"},"A+ Pre-Algebra A (Attendance)","ATT-378V1-K"]
[null,null,null,null,{"$f":"CONCATENATE(G48,\":\",F48,\"\")","v":"ATT-379V1-K:A+ HSPE Math Prep (Attendance)"},"A+ HSPE Math Prep (Attendance)","ATT-379V1-K"]
[null,null,null,null,{"$f":"CONCATENATE(G49,\":\",F49,\"\")","v":"ATT-380V1-K:A+ HSPE Science Prep (Attendance)"},"A+ HSPE Science Prep (Attendance)","ATT-380V1-K"]
[null,null,null,null,{"$f":"CONCATENATE(G50,\":\",F50,\"\")","v":"ATT-381V1-K:A+ HSPE Language Arts Prep (Attendance)"},"A+ HSPE Language Arts Prep (Attendance)","ATT-381V1-K"]
[null,null,null,null,{"$f":"CONCATENATE(G51,\":\",F51,\"\")","v":"ATT-382V1-K:A+ Computer Literacy A (Attendance)"},"A+ Computer Literacy A (Attendance)","ATT-382V1-K"]
[null,null,null,null,{"$f":"CONCATENATE(G52,\":\",F52,\"\")","v":"ATT-383V1-K:A+ Environmental Science A (Attendance)"},"A+ Environmental Science A (Attendance)","ATT-383V1-K"]
[null,null,null,null,{"$f":"CONCATENATE(G53,\":\",F53,\"\")","v":"ATT-384V1-K:A+ Chemistry I (Attendance)"},"A+ Chemistry I (Attendance)","ATT-384V1-K"]
[null,null,null,null,{"$f":"CONCATENATE(G54,\":\",F54,\"\")","v":"ATT-385V1-K:A+ American History A (Attendance)"},"A+ American History A (Attendance)","ATT-385V1-K"]
[null,null,null,null,{"$f":"CONCATENATE(G55,\":\",F55,\"\")","v":"ATT-386V1-K:A+ World History A (Attendance)"},"A+ World History A (Attendance)","ATT-386V1-K"]
[null,null,null,null,{"$f":"CONCATENATE(G56,\":\",F56,\"\")","v":"ATT-387V1-K:A+ Physical Education (Attendance)"},"A+ Physical Education (Attendance)","ATT-387V1-K"]
[null,null,null,null,{"$f":"CONCATENATE(G57,\":\",F57,\"\")","v":"ATT-596V1-K:USA Test Prep (Attendance)"},"USA Test Prep (Attendance)","ATT-596V1-K"]
[null,null,null,null,{"$f":"CONCATENATE(G58,\":\",F58,\"\")","v":"ATT-615V1-K:Michigan Virtual High School (Attendance)"},"Michigan Virtual High School (Attendance)","ATT-615V1-K"]
[null,null,null,null,{"$f":"CONCATENATE(G59,\":\",F59,\"\")","v":"ATT-616V1-K:Read Eggs (Attendance)"},"Read Eggs (Attendance)","ATT-616V1-K"]
[null,null,null,null,{"$f":"CONCATENATE(G60,\":\",F60,\"\")","v":"ATT-617V1-K:Raz Kids (Attendance)"},"Raz Kids (Attendance)","ATT-617V1-K"]
[null,null,null,null,{"$f":"CONCATENATE(G61,\":\",F61,\"\")","v":"ATTUTR:Tutoring (Attendance)"},"Tutoring (Attendance)","ATTUTR"]
[null,null,null,null,{"$f":"CONCATENATE(G62,\":\",F62,\"\")","v":"CALMS1044:A Quick Welcome to Online Learning (K-2) SY 13-14"},"A Quick Welcome to Online Learning (K-2) SY 13-14","CALMS1044"]
[null,null,null,null,{"$f":"CONCATENATE(G63,\":\",F63,\"\")","v":"CALMS1045:A Quick Welcome to Online Learning (3-5) SY 13-14"},"A Quick Welcome to Online Learning (3-5) SY 13-14","CALMS1045"]
[null,null,null,null,{"$f":"CONCATENATE(G64,\":\",F64,\"\")","v":"CALMS1099:Physical  Science"},"Physical  Science","CALMS1099"]
[null,null,null,null,{"$f":"CONCATENATE(G65,\":\",F65,\"\")","v":"CALMS1100:Advanced Life Science"},"Advanced Life Science","CALMS1100"]
[null,null,null,null,{"$f":"CONCATENATE(G66,\":\",F66,\"\")","v":"CALMS1101:Advanced Physical Science"},"Advanced Physical Science","CALMS1101"]
[null,null,null,null,{"$f":"CONCATENATE(G67,\":\",F67,\"\")","v":"CALMS1102:Intermediate World History B"},"Intermediate World History B","CALMS1102"]
[null,null,null,null,{"$f":"CONCATENATE(G68,\":\",F68,\"\")","v":"CALMS1103:Life Science"},"Life Science","CALMS1103"]
[null,null,null,null,{"$f":"CONCATENATE(G69,\":\",F69,\"\")","v":"CALMS1104:Advanced Earth Science"},"Advanced Earth Science","CALMS1104"]
[null,null,null,null,{"$f":"CONCATENATE(G70,\":\",F70,\"\")","v":"CALMS1105:Intermediate World History A"},"Intermediate World History A","CALMS1105"]
[null,null,null,null,{"$f":"CONCATENATE(G71,\":\",F71,\"\")","v":"CALMS1106:Earth Science"},"Earth Science","CALMS1106"]
[null,null,null,null,{"$f":"CONCATENATE(G72,\":\",F72,\"\")","v":"CALMS1107:American History B"},"American History B","CALMS1107"]
[null,null,null,null,{"$f":"CONCATENATE(G73,\":\",F73,\"\")","v":"CALMS1108:American History A"},"American History A","CALMS1108"]
[null,null,null,null,{"$f":"CONCATENATE(G74,\":\",F74,\"\")","v":"CALMS1127:Language Arts Purple - Cursive Handwriting"},"Language Arts Purple - Cursive Handwriting","CALMS1127"]
[null,null,null,null,{"$f":"CONCATENATE(G75,\":\",F75,\"\")","v":"CALMS1134:Language Skills 4 - GUM"},"Language Skills 4 - GUM","CALMS1134"]
[null,null,null,null,{"$f":"CONCATENATE(G76,\":\",F76,\"\")","v":"CALMS1138:Spelling 4"},"Spelling 4","CALMS1138"]
[null,null,null,null,{"$f":"CONCATENATE(G77,\":\",F77,\"\")","v":"CALMS1140:Language Skills 5 - GUM"},"Language Skills 5 - GUM","CALMS1140"]
[null,null,null,null,{"$f":"CONCATENATE(G78,\":\",F78,\"\")","v":"CALMS1144:Spelling 5"},"Spelling 5","CALMS1144"]
[null,null,null,null,{"$f":"CONCATENATE(G79,\":\",F79,\"\")","v":"CALMS1146:Intermediate Language Skills A - GUM"},"Intermediate Language Skills A - GUM","CALMS1146"]
[null,null,null,null,{"$f":"CONCATENATE(G80,\":\",F80,\"\")","v":"CALMS1147:Intermediate Language Skills A - Vocabulary"},"Intermediate Language Skills A - Vocabulary","CALMS1147"]
[null,null,null,null,{"$f":"CONCATENATE(G81,\":\",F81,\"\")","v":"CALMS1150:Intermediate Language Skills B - GUM"},"Intermediate Language Skills B - GUM","CALMS1150"]
[null,null,null,null,{"$f":"CONCATENATE(G82,\":\",F82,\"\")","v":"CALMS1151:Intermediate Language Skills B - Vocabulary"},"Intermediate Language Skills B - Vocabulary","CALMS1151"]
[null,null,null,null,{"$f":"CONCATENATE(G83,\":\",F83,\"\")","v":"CALMS1154:Literary Analysis and Composition - GUM"},"Literary Analysis and Composition - GUM","CALMS1154"]
[null,null,null,null,{"$f":"CONCATENATE(G84,\":\",F84,\"\")","v":"CALMS1155:Literary Analysis and Composition - Vocabulary"},"Literary Analysis and Composition - Vocabulary","CALMS1155"]
[null,null,null,null,{"$f":"CONCATENATE(G85,\":\",F85,\"\")","v":"CALMS1178:Math 6 - Fundamentals of Geometry & Algebra"},"Math 6 - Fundamentals of Geometry & Algebra","CALMS1178"]
[null,null,null,null,{"$f":"CONCATENATE(G86,\":\",F86,\"\")","v":"CALMS1179:Math 7 - Pre-Algebra"},"Math 7 - Pre-Algebra","CALMS1179"]
[null,null,null,null,{"$f":"CONCATENATE(G87,\":\",F87,\"\")","v":"CALMS1180:Math 8 - Algebra"},"Math 8 - Algebra","CALMS1180"]
[null,null,null,null,{"$f":"CONCATENATE(G88,\":\",F88,\"\")","v":"CALMS12:Stage 1: MARK12 Reading I"},"Stage 1: MARK12 Reading I","CALMS12"]
[null,null,null,null,{"$f":"CONCATENATE(G89,\":\",F89,\"\")","v":"CALMS121:Language Arts Blue - Literature and Comprehension"},"Language Arts Blue - Literature and Comprehension","CALMS121"]
[null,null,null,null,{"$f":"CONCATENATE(G90,\":\",F90,\"\")","v":"CALMS122:Language Arts Blue - Language Skills"},"Language Arts Blue - Language Skills","CALMS122"]
[null,null,null,null,{"$f":"CONCATENATE(G91,\":\",F91,\"\")","v":"CALMS123:Language Arts Blue - Handwriting"},"Language Arts Blue - Handwriting","CALMS123"]
[null,null,null,null,{"$f":"CONCATENATE(G92,\":\",F92,\"\")","v":"CALMS125:Language Arts Green - Literature and Comprehension"},"Language Arts Green - Literature and Comprehension","CALMS125"]
[null,null,null,null,{"$f":"CONCATENATE(G93,\":\",F93,\"\")","v":"CALMS127:Language Arts Green - Vocabulary"},"Language Arts Green - Vocabulary","CALMS127"]
[null,null,null,null,{"$f":"CONCATENATE(G94,\":\",F94,\"\")","v":"CALMS13:Stage 3: MARK12 Reading III"},"Stage 3: MARK12 Reading III","CALMS13"]
[null,null,null,null,{"$f":"CONCATENATE(G95,\":\",F95,\"\")","v":"CALMS137:Language Arts Blue - Phonics"},"Language Arts Blue - Phonics","CALMS137"]
[null,null,null,null,{"$f":"CONCATENATE(G96,\":\",F96,\"\")","v":"CALMS139:Fundamentals of Geometry and Algebra (Math 6)"},"Fundamentals of Geometry and Algebra (Math 6)","CALMS139"]
[null,null,null,null,{"$f":"CONCATENATE(G97,\":\",F97,\"\")","v":"CALMS140:Language Arts Purple - Literature and Comprehension"},"Language Arts Purple - Literature and Comprehension","CALMS140"]
[null,null,null,null,{"$f":"CONCATENATE(G98,\":\",F98,\"\")","v":"CALMS141:Language Arts Orange - Writing Skills"},"Language Arts Orange - Writing Skills","CALMS141"]
[null,null,null,null,{"$f":"CONCATENATE(G99,\":\",F99,\"\")","v":"CALMS142:Language Arts Purple - Writing Skills"},"Language Arts Purple - Writing Skills","CALMS142"]
[null,null,null,null,{"$f":"CONCATENATE(G100,\":\",F100,\"\")","v":"CALMS147:Science 5"},"Science 5","CALMS147"]
[null,null,null,null,{"$f":"CONCATENATE(G101,\":\",F101,\"\")","v":"CALMS152:Language Arts Orange - Vocabulary"},"Language Arts Orange - Vocabulary","CALMS152"]
[null,null,null,null,{"$f":"CONCATENATE(G102,\":\",F102,\"\")","v":"CALMS1528:Math Plus Purple"},"Math Plus Purple","CALMS1528"]
[null,null,null,null,{"$f":"CONCATENATE(G103,\":\",F103,\"\")","v":"CALMS1529:Math Plus Red"},"Math Plus Red","CALMS1529"]
[null,null,null,null,{"$f":"CONCATENATE(G104,\":\",F104,\"\")","v":"CALMS153:Language Arts Orange - Spelling"},"Language Arts Orange - Spelling","CALMS153"]
[null,null,null,null,{"$f":"CONCATENATE(G105,\":\",F105,\"\")","v":"CALMS1530:Math Plus Yellow"},"Math Plus Yellow","CALMS1530"]
[null,null,null,null,{"$f":"CONCATENATE(G106,\":\",F106,\"\")","v":"CALMS1535:Intermediate Mathematics A"},"Intermediate Mathematics A","CALMS1535"]
[null,null,null,null,{"$f":"CONCATENATE(G107,\":\",F107,\"\")","v":"CALMS1536:Intermediate Mathematics B"},"Intermediate Mathematics B","CALMS1536"]
[null,null,null,null,{"$f":"CONCATENATE(G108,\":\",F108,\"\")","v":"CALMS1538:Literature 4"},"Literature 4","CALMS1538"]
[null,null,null,null,{"$f":"CONCATENATE(G109,\":\",F109,\"\")","v":"CALMS1540:Language Skills 4 - Composition"},"Language Skills 4 - Composition","CALMS1540"]
[null,null,null,null,{"$f":"CONCATENATE(G110,\":\",F110,\"\")","v":"CALMS1541:Language Arts Red - Vocabulary"},"Language Arts Red - Vocabulary","CALMS1541"]
[null,null,null,null,{"$f":"CONCATENATE(G111,\":\",F111,\"\")","v":"CALMS1542:Literature 5"},"Literature 5","CALMS1542"]
[null,null,null,null,{"$f":"CONCATENATE(G112,\":\",F112,\"\")","v":"CALMS1544:Language Skills 5: Composition"},"Language Skills 5: Composition","CALMS1544"]
[null,null,null,null,{"$f":"CONCATENATE(G113,\":\",F113,\"\")","v":"CALMS1545:Language Arts Yellow - Vocabulary"},"Language Arts Yellow - Vocabulary","CALMS1545"]
[null,null,null,null,{"$f":"CONCATENATE(G114,\":\",F114,\"\")","v":"CALMS1565:Intermediate Literature A"},"Intermediate Literature A","CALMS1565"]
[null,null,null,null,{"$f":"CONCATENATE(G115,\":\",F115,\"\")","v":"CALMS1566:Intermediate Language Skills A - Composition"},"Intermediate Language Skills A - Composition","CALMS1566"]
[null,null,null,null,{"$f":"CONCATENATE(G116,\":\",F116,\"\")","v":"CALMS1567:Intermediate Literature B"},"Intermediate Literature B","CALMS1567"]
[null,null,null,null,{"$f":"CONCATENATE(G117,\":\",F117,\"\")","v":"CALMS1568:Intermediate Language Skills B - Composition"},"Intermediate Language Skills B - Composition","CALMS1568"]
[null,null,null,null,{"$f":"CONCATENATE(G118,\":\",F118,\"\")","v":"CALMS1569:Literary Analysis and Composition - Literature"},"Literary Analysis and Composition - Literature","CALMS1569"]
[null,null,null,null,{"$f":"CONCATENATE(G119,\":\",F119,\"\")","v":"CALMS157:History 1"},"History 1","CALMS157"]
[null,null,null,null,{"$f":"CONCATENATE(G120,\":\",F120,\"\")","v":"CALMS1570:Literary Analysis and Composition - Composition"},"Literary Analysis and Composition - Composition","CALMS1570"]
{"$rows_left_out":591}
{"sheet":"Version History","index":2,"n_rows":5,"n_cols":3,"rows_kept":5,"cut":false,"hidden":false,"merged":[]}
["Date","Version","Notes"]
["2013-09-03",1,"Initial Production release to teachers and staff."]
["2013-10-10",1.1000000000000001,"Update with bug fix to correct for differences between policy and tool.\nBug: Updated naming convention to use 4 \"_\" and 1 \":\" instead of 5 \"_\".\nAdded: Version, Notes and Date to NCTool Sheet."]
["2013-10-14",1.1000000000000001,"Update with bug fix to correct for differences between policy and tool.\nBug: Updated tool with \"HELPSESSION\" course code as described in policy document.\nAdded: Version History Sheet.\nRemoved: Notes on NCTool sheet."]
["2014-08-12",1.1000000000000001,"Removed protection from Required Values sheet to allow updating by other users."]